{"text_format":"3","workbook":"xlsx","n_sheets":10,"sheets":["Intro","Quest Log","Map","Character Stats","Battle","Information","Game Resource-->","Character Data","BattleProbabilities","Level Exp Tracker"],"not_rendered":{"images":16,"macros":1,"defined_names":1},"read":"whole","date_system":"1900"}

{"sheet":"Intro","index":0,"n_rows":20,"n_cols":18,"rows_kept":20,"merged":[[3,2,11,9],[18,8,18,9],[19,8,19,9]]}
[]
[]
[null,null,"Morning, Nice day for fishing ain't it!"]
[null,null,"It is the 145th year of the second age. Life in Mercer is unrecognisable to that which came earlier - The bombs saw to that. Humanity may never fully recover...\nOnce an esteemed adventurer (before you took an arrow to your knee), your days of glory have long since waned. While the wound has now mended, opportunities for hire are scarce. Few are eager to enlist the services of an aging has-been with a lingering injury.\nThe lands of Mercer seem indifferent to your existence, leaving you to pass time by the tranquil ocean, lost in memories of past adventures. This newfound tranquillity feels alien, unsettling even.\nHowever, a sudden interruption breaks your retirement—a woman dressed in shelter overalls hurries towards you, addressing you by name and beseeching your aid. Trouble looms as your friend, Shelter 7's Overseer, has been kidnapped! With  all other able arms embroiled in the ongoing Fiend and Raider conflicts, there are few capable hands left to lend support. This is your chance to reclaim your former glory.\nWithout hesitation, you and your party gather up your fishing gear. Adventure beckons once more, and you are ready to answer its call!"]
{"$rows_empty":8}
[{"$nulls":4},"Party [Choose Character 1 First]"]
[{"$nulls":4},"(Protagonist - AKA you)",null,"(Party Member 2)"]
[{"$nulls":4},"Character 1 Name:","Pear","Character 2 Name:","Dynamic"]
{"$rows_left_out":6}
{"sheet":"Quest Log","index":1,"n_rows":10,"n_cols":7,"rows_kept":10,"hidden":true}
[]
[{"$f":"Map!$BA$14","v":1},"Quest Number","Quest Name","Quest Detail","Status"]
[null,1,{"$f":"F3","v":"Find the Overseer"},{"$f":"G3","v":"Trouble looms as your friend, Shelter 7's Overseer, has been kidnapped! With  all other able arms embroiled in the ongoing Fiend and Raider conflicts, there are few capable hands left to lend support. This is your chance to reclaim your former glory."},{"$f":"IF(A2=1,\"In Progress\",\"Complete\")","v":"In Progress"},{"$f":"Map!BM40","v":"Find the Overseer"},{"$f":"Map!BP40","v":"Trouble looms as your friend, Shelter 7's Overseer, has been kidnapped! With  all other able arms embroiled in the ongoing Fiend and Raider conflicts, there are few capable hands left to lend support. This is your chance to reclaim your former glory."}]
[null,2,{"$f":"IF($A$2>1,F4,\"\")","v":""},{"$f":"IF($A$2>1,G4,\"\")","v":""},{"$f":"IF($A$2=2,\"In Progress\",IF($A$2>1,(\"Complete\"),\"\"))","v":""},{"$f":"Map!BM41","v":"Return the Overseer"},{"$f":"Map!BP41","v":"You have found the Overseer. Quick - get out of town before the Raider's spot you!\nMaybe think about taking her home?"}]
[null,3,{"$f":"IF($A$2>2,F5,\"\")","v":""},{"$f":"IF($A$2>2,G5,\"\")","v":""},{"$f":"IF($A$2=3,\"In Progress\",IF($A$2>2,(\"Complete\"),\"\"))","v":""},{"$f":"Map!BM42","v":"Find alternate sanctuary"},{"$f":"Map!BP42","v":"You don't dare enter the Vault - looks like it is completely overrun by Mutants. Whatever family the Overseer had here is long gone, get out of the area quickly!"}]
[null,4,{"$f":"IF($A$2>3,F6,\"\")","v":""},{"$f":"IF($A$2>3,G6,\"\")","v":""},{"$f":"IF($A$2=4,\"In Progress\",IF($A$2>3,(\"Complete\"),\"\"))","v":""},{"$f":"Map!BM43","v":"Find what happened to the Overseer's daughter"},{"$f":"Map!BP43","v":"This is it! For the first time in weeks the Overseer smiles at you. She feels at home and at rest.\nYou join her family in celebrating her happy return, with one noticeable absentee - the Overseer's daughter is missing!\nWe must find out where she is!"}]
[null,5,{"$f":"IF($A$2>4,F7,\"\")","v":""},{"$f":"IF($A$2>4,G7,\"\")","v":""},{"$f":"IF($A$2=5,\"In Progress\",IF($A$2>4,(\"Complete\"),\"\"))","v":""},{"$f":"Map!BM44","v":"Rescue the Overseer's daughter"},{"$f":"Map!BP44","v":"The town successfully fought off a Mutant invasion. The dying Mutants bragged of taking the Overseer's daughter back into the Mountains"}]
[null,6,{"$f":"IF($A$2>5,F8,\"\")","v":""},{"$f":"IF($A$2>5,G8,\"\")","v":""},{"$f":"IF($A$2=6,\"In Progress\",IF($A$2>5,(\"Complete\"),\"\"))","v":""},{"$f":"Map!BM45","v":"Tell the Head Overseer"},{"$f":"Map!BP45","v":"Your party successfully sneaks into town and rescues the Overseer's daughter. Quick take him to the lead Overseer in Vault 0 and pass on the message of the invading Mutant hoard!"}]
{"$rows_left_out":3}
{"sheet":"Map","index":2,"n_rows":47,"n_cols":77,"rows_kept":47,"hidden":true,"merged":[[8,52,8,54],[11,56,12,56],[16,51,17,51],[16,52,17,52],[16,54,17,54]]}
[null,1,2,3,4,5,6,7,8,9,10,11,12,13,14,15,16,17,18,19,20,21,22,23,24,25,26,27,28,29,30,31,32,33,34,35,36,37,38,39,40,41,42,43,44,45,46,47,48,49,50]
[1,{"$nulls":3},"Beggar's Hole",{"$nulls":42},"Everwinter",{"$nulls":4},"Map Movement",null,"MAP Key",{"$nulls":7},"Message",1,2,3,4,5,6,7,{"$nulls":3},"Key Info for questing"]
[2,{"$nulls":18},"Carnage",{"$nulls":35},"Town",{"$nulls":6},"Beggar's Hole","Welcome to our town Adventurer! No, the Overseer isn't here. Rest up and try somewhere else!","You speak to the Overseer - she tells you that she doesn't recognise the area. She is from Vault 7","The Overseer is distraught. She cannot remember which town  her cousins hailed from, somewhere East, but it definitely isn't this town.","The town successfully fought off a Mutant invasion. The dying Mutants bragged of taking the Overseer's daughter back into the Mountains","The town is awash with Mutant blood. Thankfully the town remains in the people's hands. It seems we are close to the source of the Mutants.","The town is on the mend nicely, and they receive you warmly! Perhaps we best be off visit the Head Overseer?","What a lovely town. You feel fully rested-  but it is really time to be heading back home","."]
[3,{"$nulls":54},"Farming Area",{"$nulls":6},"Vault 7","Welcome to our Vault Adventurer! No, the Overseer isn't here. We have heard rumours that she was taken somewhere to the South. ","You don't dare enter the Vault - looks like it is completely overrun by Mutants. Whatever family the Overseer had here is long gone, get out of the area quickly!","This vault is still infested by Mutants - why have you come back?","This vault is still infested by Mutants - why have you come back?","This vault is still infested by Mutants - why have you come back?","This vault is still infested by Mutants - why have you come back?","The vault is awash with Mutant blood. Thankfully the town has been restored to the people's hands, but at what cost?",".",null,null,"Town Locations","Town Name","Pop up message","Game State Progression"]
[4,{"$nulls":34},"Shadewood",{"$nulls":19},"Plain",{"$nulls":6},"Garen's Rest","Welcome home Adventurer! It seems a group of Raiders did come through our town with a young women captive. They looked to be heading South-East","You speak to the Overseer - she tells you that she doesn't recognise the area. She is from Vault 7","The Overseer is distraught. She cannot remember which town  her cousins hailed from, somewhere East, but it definitely isn't this town.","Welcome to our town Adventurer! We have no idea where the Overseer's daughter is. Rest up and try somewhere else!","Welcome to our town Adventurer! Thank the gods, no Mutants have been sighted near the town walls. Rumour has it they are descending from the mountains in the North?","Welcome to our town Adventurer! Perhaps we best be off visit the Head Overseer?","What an adventure. It is time to put up your legs and rest!",".",null,null,"$D$2",{"$f":"BK3","v":"Beggar's Hole"},{"$f":"VLOOKUP(BW5,$BK$3:$BR$18,$BA$14+1,FALSE)","v":"Welcome to our town Adventurer! No, the Overseer isn't here. Rest up and try somewhere else!"},{"$f":"VLOOKUP(BW5,$BK$21:$BR$36,$BA$14+1,FALSE)","v":1}]
[5,{"$nulls":54},"Water",{"$nulls":6},"Slumberville","Welcome to our town Adventurer! No, the Overseer isn't here. We have heard rumours that she was taken somewhere to along our coast, more to the East.","You speak to the Overseer - she tells you that she doesn't recognise the area. She is from Vault 8","The Overseer is distraught. She cannot remember which town  her cousins hailed from, somewhere East, but it definitely isn't this town.","Welcome to our town Adventurer! We have no idea where the Overseer's daughter is. Rest up and try somewhere else!","Welcome to our town Adventurer! Thank the gods, no Mutants have been sighted near the town walls. Rumour has it they are descending from the mountains in the North?","Welcome to our town Adventurer! Perhaps we best be off visit the Head Overseer?","What a lovely town. You feel fully rested-  but it is really time to be heading back home",".",null,null,"$K$9",{"$f":"BK4","v":"Vault 7"},{"$f":"VLOOKUP(BW6,$BK$3:$BR$18,$BA$14+1,FALSE)","v":"Welcome to our Vault Adventurer! No, the Overseer isn't here. We have heard rumours that she was taken somewhere to the South. "},{"$f":"VLOOKUP(BW6,$BK$21:$BR$36,$BA$14+1,FALSE)","v":1}]
[6,{"$nulls":54},"Mountains",{"$nulls":6},"Carnage","Welcome to our town Adventurer! No, the Overseer isn't here. Rest up and try somewhere else!","You speak to the Overseer - she tells you that she doesn't recognise the area. She is from Vault 9","This town is infested by the stench of Mutants. We better clear out quickly","Your party successfully sneaks into town and rescues the Overseer's daughter. Quick take him to the lead Overseer in Vault 0 and pass on the message of the invading Mutant hoard!","Your party successfully sneaks into town and rescues the Overseer's daughter. Quick take him to the lead Overseer in Vault 0 and pass on the message of the invading Mutant hoard!","This town is infested by the stench of Mutants. We better clear out quickly","The town is awash with Mutant blood. Thankfully the town has been restored to the people's hands, but at what cost?",".",null,null,"$F$13","Garen's Rest","Welcome home Adventurer! It seems a group of Raiders did come through our town with a young women captive. They looked to be heading South-East",1]
[7,{"$nulls":45},"The Curtains",{"$nulls":8},"Bomb Crater",{"$nulls":6},"Haling Cove","You have found the Overseer. Quick - get out of town before the Raider's spot you!\nMaybe think about taking her home?","You speak to the Overseer - she tells you that she doesn't recognise the area. She is from Vault 10","The Overseer is distraught. She cannot remember which town  her cousins hailed from, somewhere East, but it definitely isn't this town.","Welcome to our town Adventurer! We have no idea where the Overseer's daughter is. Rest up and try somewhere else!","Welcome to our town Adventurer! Thank the gods, no Mutants have been sighted near the town walls. Rumour has it they are descending from the mountains in the North?","Welcome to our town Adventurer! Perhaps we best be off visit the Head Overseer?","What a lovely town. You feel fully rested-  but it is really time to be heading back home",".",null,null,"$D$19","Slumberville","Welcome to our town Adventurer! No, the Overseer isn't here. We have heard rumours that she was taken somewhere to along our coast, more to the East.",1]
{"$rows_left_out":40}
{"sheet":"Character Stats","index":3,"n_rows":25,"n_cols":15,"rows_kept":25,"hidden":true}
[]
[null,"Name",{"$f":"Intro!F15","v":"Pear"},{"$f":"Intro!H15","v":"Dynamic"},{"$nulls":8},"Slugger","Thrower","Ranger"]
[null,"Image",{"$f":"Map!BA17","v":{"$error":"#VALUE!"}},{"$f":"Map!BC17","v":{"$error":"#VALUE!"}},{"$nulls":7},"Level",{"$f":"Battle!V3","v":1},{"$f":"Battle!W3","v":1},{"$f":"Battle!X3","v":1}]
[null,"Level",{"$f":"Map!BA22","v":1},{"$f":"C4","v":1},{"$nulls":7},"HP",{"$f":"Battle!V4","v":17},{"$f":"Battle!W4","v":13},{"$f":"Battle!X4","v":16}]
[null,"Class",{"$f":"Intro!F16","v":"Slugger"},{"$f":"Intro!H16","v":"Ranger"},{"$nulls":7},"Strength",{"$f":"Battle!V5","v":17},{"$f":"Battle!W5","v":9},{"$f":"Battle!X5","v":12}]
[null,"Health Points",{"$f":"HLOOKUP(C$5,$L$2:$O$19,3,FALSE)","v":17},{"$f":"HLOOKUP(D$5,$L$2:$O$19,3,FALSE)","v":16},{"$nulls":7},"Dexterity",{"$f":"Battle!V6","v":13},{"$f":"Battle!W6","v":14},{"$f":"Battle!X6","v":17}]
[null,"Strength",{"$f":"HLOOKUP(C$5,$L$2:$O$19,4,FALSE)","v":17},{"$f":"HLOOKUP(D$5,$L$2:$O$19,4,FALSE)","v":12},{"$nulls":7},"Constitution",{"$f":"Battle!V7","v":15},{"$f":"Battle!W7","v":15},{"$f":"Battle!X7","v":13}]
[null,"Dexterity",{"$f":"HLOOKUP(C$5,$L$2:$O$19,5,FALSE)","v":13},{"$f":"HLOOKUP(D$5,$L$2:$O$19,5,FALSE)","v":17},{"$nulls":7},"Intelligence",{"$f":"Battle!V9","v":10},{"$f":"Battle!W9","v":16},{"$f":"Battle!X9","v":10}]
{"$rows_left_out":18}
{"sheet":"Battle","index":4,"n_rows":94,"n_cols":35,"rows_kept":94,"hidden":true,"merged":[[3,7,3,9],[4,7,4,9],[5,7,5,9],[6,7,6,9],[7,7,7,9],[31,0,31,7],[51,0,51,7],[72,1,72,3],[73,1,73,3],[74,1,74,3],[75,1,75,3],[76,1,76,3]]}
[{"$nulls":10},"Ambush","Type of Battle",{"$f":"K1","v":"Ambush"},{"$f":"VLOOKUP(M1,'Character Data'!N25:O27,2,FALSE)","v":7}]
["Enemies",1,2,3,4,5,null,null,{"$f":"MAX(E13:E19)","v":2},null,"Giant Rat","Enemies",{"$f":"K2","v":"Giant Rat"},{"$nulls":8},"Slugger","Thrower","Ranger","Mutant Warrior","Mutant Shooter","Feral Warrior","Feral Archer","Ghost","Giant Rat","Fiend Warrior","Fiend Shooter","Bear","Raider Warrior","Raider Archer"]
["Name",{"$f":"IF(L5=0,\"\",L5)","v":"Giant Rat"},{"$f":"IF(M5=0,\"\",M5)","v":"Giant Rat"},{"$f":"IF(N5=0,\"\",N5)","v":""},{"$f":"IF(O5=0,\"\",O5)","v":""},{"$f":"IF(P5=0,\"\",P5)","v":""},{"$nulls":14},"Level",{"$f":"Map!$BA$22","v":1},{"$f":"$V$3","v":1},{"$f":"$W$3","v":1},1,1,1,1,1,1,1,1,1,1,1]
["Image",{"$f":"IFERROR(IF(B5=0,$U$22,HLOOKUP(B$3,$Y$2:$AI$22,21,FALSE)),\"\")","v":{"$error":"#VALUE!"}},{"$f":"IFERROR(IF(C5=0,$U$22,HLOOKUP(C$3,$Y$2:$AI$22,21,FALSE)),\"\")","v":{"$error":"#VALUE!"}},{"$f":"IFERROR(IF(D5=0,$U$22,HLOOKUP(D$3,$Y$2:$AI$22,21,FALSE)),\"\")","v":{"$error":"#VALUE!"}},{"$f":"IFERROR(IF(E5=0,$U$22,HLOOKUP(E$3,$Y$2:$AI$22,21,FALSE)),\"\")","v":{"$error":"#VALUE!"}},{"$f":"IFERROR(IF(F5=0,$U$22,HLOOKUP(F$3,$Y$2:$AI$22,21,FALSE)),\"\")","v":{"$error":"#VALUE!"}},null,"It's Dynamic's turn",{"$nulls":3},1,2,3,4,5,{"$nulls":4},"HP",{"$f":"HLOOKUP($V$3,'Character Data'!$C$5:$L$21,2,FALSE)","v":17},{"$f":"HLOOKUP($W$3,'Character Data'!$C$25:$L$41,2,FALSE)","v":13},{"$f":"HLOOKUP($X$3,'Character Data'!$C$45:$L$61,2,FALSE)","v":16},{"$f":"'Character Data'!O6","v":7},{"$f":"'Character Data'!P6","v":7},{"$f":"'Character Data'!Q6","v":13},{"$f":"'Character Data'!R6","v":13},{"$f":"'Character Data'!S6","v":45},{"$f":"'Character Data'!T6","v":7},{"$f":"'Character Data'!U6","v":15},{"$f":"'Character Data'!V6","v":15},{"$f":"'Character Data'!W6","v":34},{"$f":"'Character Data'!X6","v":11},{"$f":"'Character Data'!Y6","v":11}]
["Health",0,0,0,0,0,null,"Dynamic moves 0 metres",{"$nulls":3},{"$f":"VLOOKUP(Battle!$M$2,'Character Data'!$AB$13:$AG$24,2,FALSE)","v":"Giant Rat"},{"$f":"VLOOKUP(Battle!$M$2,'Character Data'!$AB$13:$AG$24,3,FALSE)","v":"Giant Rat"},{"$f":"IF(Map!$BA$22=1,\"\",VLOOKUP(Battle!$M$2,'Character Data'!$AB$13:$AG$24,4,FALSE))","v":""},{"$f":"IF(Map!$BA$22=1,\"\",VLOOKUP(Battle!$M$2,'Character Data'!$AB$13:$AG$24,5,FALSE))","v":""},{"$f":"IF(Map!$BC$22=1,\"\",VLOOKUP(Battle!$M$2,'Character Data'!$AB$13:$AG$24,6,FALSE))","v":""},{"$nulls":4},"Strength",{"$f":"HLOOKUP($V$3,'Character Data'!$C$5:$L$21,3,FALSE)","v":17},{"$f":"HLOOKUP($W$3,'Character Data'!$C$25:$L$41,3,FALSE)","v":9},{"$f":"HLOOKUP($X$3,'Character Data'!$C$45:$L$61,3,FALSE)","v":12},{"$f":"'Character Data'!O7","v":8},{"$f":"'Character Data'!P7","v":8},{"$f":"'Character Data'!Q7","v":10},{"$f":"'Character Data'!R7","v":10},{"$f":"'Character Data'!S7","v":7},{"$f":"'Character Data'!T7","v":7},{"$f":"'Character Data'!U7","v":16},{"$f":"'Character Data'!V7","v":16},{"$f":"'Character Data'!W7","v":19},{"$f":"'Character Data'!X7","v":11},{"$f":"'Character Data'!Y7","v":0}]
["Weapon",{"$f":"HLOOKUP(B$3,$Y$2:$AI$21,14,FALSE)","v":"Bite"},{"$f":"IFERROR(HLOOKUP(C$3,$Y$2:$AI$21,14,FALSE),\"\")","v":"Bite"},{"$f":"IFERROR(HLOOKUP(D$3,$Y$2:$AI$21,14,FALSE),\"\")","v":""},{"$f":"IFERROR(HLOOKUP(E$3,$Y$2:$AI$21,14,FALSE),\"\")","v":""},{"$f":"IFERROR(HLOOKUP(F$3,$Y$2:$AI$21,14,FALSE),\"\")","v":""},null,"Dynamic targets Giant Rat",null,null,2,1,2,2,2,1,{"$nulls":4},"Dexterity",{"$f":"HLOOKUP($V$3,'Character Data'!$C$5:$L$21,4,FALSE)","v":13},{"$f":"HLOOKUP($W$3,'Character Data'!$C$25:$L$41,4,FALSE)","v":14},{"$f":"HLOOKUP($X$3,'Character Data'!$C$45:$L$61,4,FALSE)","v":17},{"$f":"'Character Data'!O8","v":14},{"$f":"'Character Data'!P8","v":14},{"$f":"'Character Data'!Q8","v":14},{"$f":"'Character Data'!R8","v":14},{"$f":"'Character Data'!S8","v":13},{"$f":"'Character Data'!T8","v":15},{"$f":"'Character Data'!U8","v":12},{"$f":"'Character Data'!V8","v":12},{"$f":"'Character Data'!W8","v":10},{"$f":"'Character Data'!X8","v":12},{"$f":"'Character Data'!Y8","v":0}]
["Armour Class",{"$f":"HLOOKUP(B$3,$Y$2:$AI$21,12,FALSE)","v":12},{"$f":"IFERROR(HLOOKUP(C$3,$Y$2:$AI$21,12,FALSE),\"\")","v":12},{"$f":"IFERROR(HLOOKUP(D$3,$Y$2:$AI$21,12,FALSE),\"\")","v":""},{"$f":"IFERROR(HLOOKUP(E$3,$Y$2:$AI$21,12,FALSE),\"\")","v":""},{"$f":"IFERROR(HLOOKUP(F$3,$Y$2:$AI$21,12,FALSE),\"\")","v":""},null,"Dynamic hits",{"$nulls":3},{"$f":"IF(L5=0,\"\",$N$1)","v":7},{"$f":"IF(M5=0,\"\",$N$1)","v":7},{"$f":"IF(N5=0,\"\",$N$1)","v":7},{"$f":"IF(O5=0,\"\",$N$1)","v":7},{"$f":"IF(P5=0,\"\",$N$1)","v":7},{"$nulls":4},"Constitution",{"$f":"HLOOKUP($V$3,'Character Data'!$C$5:$L$21,5,FALSE)","v":15},{"$f":"HLOOKUP($W$3,'Character Data'!$C$25:$L$41,5,FALSE)","v":15},{"$f":"HLOOKUP($X$3,'Character Data'!$C$45:$L$61,5,FALSE)","v":13},{"$f":"'Character Data'!O9","v":10},{"$f":"'Character Data'!P9","v":10},{"$f":"'Character Data'!Q9","v":15},{"$f":"'Character Data'!R9","v":15},{"$f":"'Character Data'!S9","v":10},{"$f":"'Character Data'!T9","v":11},{"$f":"'Character Data'!U9","v":16},{"$f":"'Character Data'!V9","v":16},{"$f":"'Character Data'!W9","v":16},{"$f":"'Character Data'!X9","v":12},{"$f":"'Character Data'!Y9","v":0}]
["Movement Range",{"$f":"HLOOKUP(B$3,$Y$2:$AI$22,19,FALSE)","v":6},{"$f":"IFERROR(HLOOKUP(C$3,$Y$2:$AI$22,19,FALSE),\"\")","v":6},{"$f":"IFERROR(HLOOKUP(D$3,$Y$2:$AI$22,19,FALSE),\"\")","v":""},{"$f":"IFERROR(HLOOKUP(E$3,$Y$2:$AI$22,19,FALSE),\"\")","v":""},{"$f":"IFERROR(HLOOKUP(F$3,$Y$2:$AI$22,19,FALSE),\"\")","v":""},null,"Dynamic hits Giant Rat for 7 damage"]
{"$rows_left_out":80}
{"sheet":"Information","index":5,"n_rows":47,"n_cols":2,"rows_kept":47,"hidden":true,"merged":[[3,1,3,11],[4,1,4,11],[11,1,11,11],[20,1,21,11],[23,1,24,11],[27,1,29,11],[35,1,36,11],[46,1,47,11]]}
[]
[]
[]
[null,"Welcome to the world of Mercer!"]
[null,"Mercer is the home of a Fallout inspired adventure game"]
[]
[null,"There are two key game components to understand to get maximum fun"]
[null,"1. Mapping and Questing"]
{"$rows_left_out":40}
{"sheet":"Game Resource-->","index":6,"n_rows":0,"n_cols":0,"rows_kept":0,"hidden":true}

{"sheet":"Character Data","index":7,"n_rows":61,"n_cols":33,"rows_kept":61,"hidden":true}
[{"$nulls":13},"Enemy Types",{"$nulls":12},"Mutant Warrior",null,"Feral Warrior"]
[{"$nulls":26},"Mutant Shooter",null,"Feral Shooter"]
[null,"Character",{"$nulls":11},"Character"]
[null,"Slugger"]
[null,"Level",1,2,3,4,5,6,7,8,9,10,null,"Level","Mutant Warrior","Mutant Shooter","Feral Warrior","Feral Archer","Ghost","Giant Rat","Fiend Warrior","Fiend Shooter","Bear","Raider Warrior","Raider Archer",null,"Ghost",null,"Rats"]
[null,"HP",17,25,33,41,49,57,65,73,81,89,null,"HP",7,7,13,13,45,7,15,15,34,11,11]
[null,"Strength",17,17,17,18,18,18,18,20,20,20,null,"Strength",8,8,10,10,7,7,16,16,19,11,null,null,"Fiend Warrior",null,"Bear"]
[null,"Dexterity",13,13,13,14,14,14,14,16,16,16,null,"Dexterity",14,14,14,14,13,15,12,12,10,12,null,null,"Fiend Shooter"]
{"$rows_left_out":54}
{"sheet":"BattleProbabilities","index":8,"n_rows":13,"n_cols":18,"rows_kept":13,"hidden":true}
["Prob.",1,2,3,4,5,6,7,8]
["Small Group of Mutants",1,1,1,1,1,1,1,0,null,0.04,0.09,0,0,0.19,0.15,0.15,0]
["Group of Mutants",1,1,1,1,1,1,1,0,null,0.04,0.09,0.2,0.1,0.19,0.15,0.15,0]
["Large Groub of Mutants",null,1,1,1,1,1,1,0,null,0.04,0.09,0.37,0.46,0.19,0.15,0.15,0]
["Ghost",0,0,0,0,0,1,1,1,null,0.01,0.01,0.01,0.03,0.05,0.07,0.07,0.12]
["Small Group of Fiends",0,0,0,1,1,1,1,1,null,0.025,0.025,0.025,0.05,0.05,0.07,0.07,0.12]
["Group of Fiends",0,0,0,1,1,1,1,1,null,0.025,0.025,0.025,0.05,0.05,0.07,0.07,0.12]
["Small group of Raiders",1,1,1,0,0,0,0,0,null,0.25,0.2,0.1,0.05,0.05,0.07,0.07,0.12]
{"$rows_left_out":6}
{"sheet":"Level Exp Tracker","index":9,"n_rows":5,"n_cols":17,"rows_kept":5,"hidden":true}
[{"$nulls":3},"Sum of Exp"]
[{"$nulls":3},{"$f":"SUM(A:A)","v":0}]
[{"$nulls":5},1,2,3,4,5,6,7,8,9,10]
[{"$nulls":5},3,3,5,5,7,7,9,11,15,9999999,null,{"$f":"SUM(F4:O4)","v":10000064}]
[{"$nulls":5},{"$f":"IF($D$2>F4-0.1,1,0)","v":0},{"$f":"IF($D$2>G4-0.1,1,0)","v":0},0,0,0,0,0,0,{"$f":"IF($D$2>N4-0.1,1,0)","v":0},{"$f":"IF($D$2>N4-0.1,1,0)","v":0}]